ID,PERCENTAGE_ART_ADHERENCE_PRE,PERCENTAGE_ART_ADHERENCE_POST,GAD1_PRE,GAD2_PRE,GAD3_PRE,GAD4_PRE,GAD5_PRE,GAD6_PRE,GAD7_PRE,GAD_TOTAL_PRE,GAD1_POST,GAD2_POST,GAD3_POST,GAD4_POST,GAD5_POST,GAD6_POST,GAD7_POST,GAD_TOTAL_POST,PHQ1_PRE,PHQ2_PRE,PHQ3_PRE,PHQ4_PRE,PHQ5_PRE,PHQ6_PRE,PHQ7_PRE,PHQ8_PRE,PHQ9_PRE,PHQ_TOTAL_PRE,PHQ1_POST,PHQ2_POST,PHQ3_POST,PHQ4_POST,PHQ5_POST,PHQ6_POST,PHQ7_POST,PHQ8_POST,PHQ9_POST,PHQ_TOTAL_POST
153.0,9333333333.0,100.0,0.0,1.0,2.0,0.0,0.0,0.0,1.0,4.0,,,,,,,,,1.0,0.0,2.0,1.0,0.0,0.0,0.0,0.0,0.0,4.0,,,,,,,,,,
190.0,100.0,,3.0,3.0,3.0,0.0,0.0,3.0,0.0,12.0,0.0,0.0,0.0,0.0,0.0,0.0,0.0,0.0,3.0,0.0,0.0,0.0,2.0,1.0,0.0,2.0,0.0,8.0,,,,,,,,,,
282.0,100.0,,1.0,2.0,2.0,2.0,1.0,1.0,0.0,9.0,,,,,,,,,0.0,2.0,1.0,2.0,2.0,1.0,0.0,1.0,2.0,11.0,0.0,1.0,2.0,1.0,2.0,0.0,0.0,0.0,0.0,6.0
505.0,100.0,,1.0,2.0,1.0,1.0,0.0,2.0,2.0,9.0,,,,,,,,,0.0,2.0,1.0,2.0,0.0,2.0,2.0,1.0,0.0,10.0,0.0,0.0,0.0,1.0,0.0,0.0,0.0,3.0,0.0,4.0
522.0,80.0,100.0,0.0,0.0,1.0,0.0,0.0,1.0,2.0,4.0,,,,,,,,,2.0,1.0,2.0,2.0,2.0,1.0,0.0,0.0,0.0,10.0,0.0,0.0,0.0,0.0,0.0,0.0,0.0,0.0,0.0,0.0
546.0,93.33333333,100.0,1.0,1.0,1.0,0.0,1.0,1.0,1.0,6.0,,,,,,,,,1.0,0.0,0.0,1.0,1.0,0.0,1.0,0.0,0.0,4.0,,,,,,,,,,
652.0,96.66666667,,3.0,2.0,3.0,1.0,1.0,3.0,0.0,13.0,2.0,0.0,1.0,0.0,0.0,0.0,1.0,4.0,2.0,3.0,1.0,2.0,3.0,3.0,2.0,1.0,1.0,18.0,0.0,1.0,0.0,1.0,0.0,1.0,0.0,0.0,0.0,3.0
773.0,98.33333333,,2.0,3.0,3.0,0.0,0.0,0.0,3.0,11.0,1.0,1.0,1.0,0.0,0.0,0.0,0.0,3.0,0.0,0.0,0.0,3.0,0.0,1.0,0.0,0.0,0.0,4.0,,,,,,,,,,
794.0,100.0,,2.0,2.0,2.0,2.0,2.0,2.0,2.0,14.0,1.0,1.0,1.0,0.0,0.0,3.0,1.0,7.0,1.0,2.0,1.0,1.0,1.0,1.0,1.0,1.0,1.0,10.0,1.0,1.0,0.0,3.0,1.0,1.0,0.0,0.0,0.0,7.0
825.0,100.0,,2.0,1.0,3.0,1.0,1.0,3.0,1.0,12.0,0.0,0.0,2.0,1.0,0.0,1.0,0.0,4.0,2.0,1.0,2.0,3.0,2.0,2.0,1.0,1.0,0.0,14.0,0.0,0.0,1.0,2.0,0.0,0.0,0.0,0.0,0.0,3.0
846.0,100.0,,2.0,1.0,2.0,1.0,3.0,2.0,2.0,13.0,2.0,3.0,3.0,3.0,3.0,3.0,3.0,20.0,1.0,1.0,1.0,1.0,3.0,1.0,1.0,1.0,0.0,10.0,3.0,2.0,2.0,3.0,3.0,3.0,2.0,2.0,0.0,20.0
851.0,100.0,,2.0,0.0,1.0,1.0,0.0,0.0,2.0,6.0,,,,,,,,,1.0,0.0,0.0,0.0,1.0,0.0,0.0,0.0,0.0,2.0,,,,,,,,,,
854.0,100.0,,0.0,0.0,1.0,1.0,1.0,2.0,2.0,7.0,,,,,,,,,0.0,0.0,0.0,1.0,0.0,1.0,0.0,0.0,1.0,3.0,,,,,,,,,,
916.0,100.0,,1.0,1.0,1.0,1.0,1.0,2.0,3.0,10.0,1.0,0.0,1.0,1.0,3.0,1.0,1.0,8.0,3.0,1.0,0.0,3.0,3.0,1.0,3.0,3.0,0.0,17.0,1.0,1.0,1.0,3.0,3.0,1.0,3.0,3.0,0.0,16.0
991.0,100.0,,3.0,0.0,2.0,3.0,2.0,3.0,2.0,15.0,3.0,2.0,3.0,2.0,3.0,3.0,3.0,19.0,0.0,1.0,3.0,0.0,0.0,0.0,1.0,3.0,0.0,8.0,,,,,,,,,,
1014.0,91.11111111,100.0,1.0,0.0,2.0,1.0,3.0,3.0,3.0,13.0,,,,,,,,,1.0,3.0,3.0,1.0,1.0,0.0,0.0,3.0,0.0,12.0,0.0,0.0,0.0,0.0,3.0,0.0,0.0,0.0,0.0,3.0
1023.0,100.0,,0.0,0.0,1.0,0.0,0.0,0.0,0.0,1.0,,,,,,,,,0.0,0.0,0.0,1.0,0.0,0.0,0.0,0.0,0.0,1.0,,,,,,,,,,
1038.0,100.0,,1.0,3.0,0.0,0.0,0.0,2.0,2.0,8.0,,,,,,,,,2.0,3.0,3.0,3.0,3.0,2.0,3.0,2.0,1.0,22.0,3.0,3.0,3.0,2.0,2.0,3.0,2.0,0.0,2.0,20.0
1192.0,100.0,,1.0,1.0,1.0,1.0,0.0,0.0,1.0,5.0,,,,,,,,,2.0,2.0,2.0,1.0,1.0,1.0,1.0,1.0,0.0,11.0,0.0,1.0,1.0,0.0,0.0,1.0,0.0,0.0,0.0,3.0
1244.0,90.0,100.0,2.0,2.0,2.0,2.0,2.0,2.0,2.0,14.0,1.0,0.0,0.0,0.0,0.0,0.0,0.0,1.0,3.0,3.0,3.0,2.0,0.0,2.0,3.0,3.0,0.0,19.0,1.0,1.0,0.0,0.0,0.0,0.0,0.0,0.0,0.0,2.0
1262.0,100.0,,0.0,0.0,1.0,0.0,0.0,0.0,0.0,1.0,,,,,,,,,0.0,1.0,0.0,0.0,0.0,0.0,0.0,0.0,0.0,1.0,,,,,,,,,,
1277.0,96.66666667,,0.0,1.0,1.0,0.0,0.0,2.0,1.0,5.0,,,,,,,,,1.0,0.0,2.0,3.0,2.0,2.0,0.0,0.0,1.0,11.0,1.0,0.0,0.0,1.0,0.0,0.0,0.0,0.0,0.0,2.0
1291.0,100.0,,1.0,0.0,1.0,1.0,1.0,1.0,2.0,7.0,,,,,,,,,1.0,1.0,2.0,0.0,1.0,0.0,0.0,1.0,0.0,6.0,,,,,,,,,,
1319.0,100.0,,3.0,3.0,3.0,3.0,0.0,0.0,1.0,13.0,1.0,0.0,0.0,0.0,0.0,1.0,0.0,2.0,0.0,2.0,3.0,3.0,0.0,1.0,0.0,0.0,1.0,10.0,0.0,0.0,1.0,1.0,0.0,0.0,0.0,0.0,0.0,2.0
1335.0,100.0,,1.0,0.0,2.0,2.0,3.0,2.0,1.0,11.0,1.0,1.0,1.0,0.0,1.0,3.0,1.0,8.0,0.0,0.0,2.0,0.0,2.0,0.0,1.0,0.0,0.0,5.0,,,,,,,,,,
1379.0,86.66666667,100.0,1.0,1.0,1.0,1.0,1.0,1.0,1.0,7.0,,,,,,,,,1.0,0.0,0.0,0.0,0.0,0.0,0.0,0.0,0.0,1.0,,,,,,,,,,
1380.0,100.0,,2.0,2.0,1.0,2.0,1.0,3.0,1.0,12.0,1.0,1.0,0.0,1.0,0.0,0.0,1.0,4.0,1.0,2.0,2.0,1.0,1.0,2.0,1.0,0.0,0.0,10.0,1.0,1.0,1.0,0.0,1.0,0.0,1.0,0.0,0.0,5.0
